Reaction Details
TargetGlucose-6-phosphate 1-dehydrogenase
LigandBDBM50223368
Substrate/Competitorn/a
Meas. Tech.ChEMBL_542431 (CHEMBL1011499)
Ki 8900±n/a nM
Citation Cordeiro, ATThiemann, OHMichels, PA Inhibition of Trypanosoma brucei glucose-6-phosphate dehydrogenase by human steroids and their effects on the viability of cultured parasites. Bioorg Med Chem17:2483-9 (2009) 
 
Glucose-6-phosphate 1-dehydrogenase
Name:Glucose-6-phosphate 1-dehydrogenase
Type:Enzyme
Mol. Mass.:59258.58
Organism:Homo sapiens (Human)
Description:P11413
Residue:515
BDBM50223368
NameBDBM50223368
Synonyms:3beta-hydroxyandrost-5-en-17-one DHEAS Prasterone
TypeSmall organic molecule
Emp. Form.C19H28O2
Mol. Mass.288.4244
SMILESC[C@]12CC[C@H]3[C@@H](CC=C4C[C@@H](O)CC[C@]34C)[C@@H]1CCC2=O