Reaction Details
TargetGlucose-6-phosphate 1-dehydrogenase
LigandBDBM50236240
Substrate/Competitorn/a
Meas. Tech.ChEMBL_542431 (CHEMBL1011499)
Ki 3400±n/a nM
Citation Cordeiro, ATThiemann, OHMichels, PA Inhibition of Trypanosoma brucei glucose-6-phosphate dehydrogenase by human steroids and their effects on the viability of cultured parasites. Bioorg Med Chem17:2483-9 (2009) 
 
Glucose-6-phosphate 1-dehydrogenase
Name:Glucose-6-phosphate 1-dehydrogenase
Type:Enzyme
Mol. Mass.:59258.58
Organism:Homo sapiens (Human)
Description:P11413
Residue:515
BDBM50236240
NameBDBM50236240
Synonyms:5alpha-androstan-3beta-OL-17-one Epiandrosterone | epi-andosterone
TypeSmall organic molecule
Emp. Form.C19H30O2
Mol. Mass.290.4403
SMILESC[C@]12CC[C@H]3[C@@H](CC[C@H]4C[C@@H](O)CC[C@]34C)[C@@H]1CCC2=O