Reaction Details
TargetCarbonic anhydrase 2
LigandBDBM50240689
Substrate/Competitorn/a
Meas. Tech.ChEMBL_564155 (CHEMBL956075)
Ki 420±n/a nM
Citation Sentürk, MGülçin, IDastan, AKüfrevioqlu, OISupuran, CT Carbonic anhydrase inhibitors. Inhibition of human erythrocyte isozymes I and II with a series of antioxidant phenols. Bioorg Med Chem17:3207-11 (2009) 
 
Carbonic anhydrase 2
Name:Carbonic anhydrase 2
Type:Enzyme
Mol. Mass.:29250.71
Organism:Homo sapiens (Human)
Description:P00918
Residue:260
BDBM50240689
NameBDBM50240689
Synonyms:2,6-Di-tert-butyl-4-methoxy-phenol CHEMBL98253
TypeSmall organic molecule
Emp. Form.C15H24O2
Mol. Mass.236.3499
SMILESCOc1cc(c(O)c(c1)C(C)(C)C)C(C)(C)C