Reaction Details
TargetCarbonic anhydrase 2
LigandBDBM50266963
Substrate/Competitorn/a
Meas. Tech.ChEMBL_564155 (CHEMBL956075)
Ki 1250±n/a nM
Citation Sentürk, MGülçin, IDastan, AKüfrevioqlu, OISupuran, CT Carbonic anhydrase inhibitors. Inhibition of human erythrocyte isozymes I and II with a series of antioxidant phenols. Bioorg Med Chem17:3207-11 (2009) 
 
Carbonic anhydrase 2
Name:Carbonic anhydrase 2
Type:Enzyme
Mol. Mass.:29250.71
Organism:Homo sapiens (Human)
Description:P00918
Residue:260
BDBM50266963
NameBDBM50266963
Synonyms:3-hydroxy-2-methoxybenzaldehyde | CHEMBL507918
TypeSmall organic molecule
Emp. Form.C8H8O3
Mol. Mass.152.1473
SMILESCOc1c(O)cccc1C=O