Reaction Details
TargetNeuronal acetylcholine receptor subunit alpha-4
LigandBDBM50062641
Substrate/Competitorn/a
Meas. Tech.ChEMBL_565979 (CHEMBL963253)
Ki 0.048±n/a nM
Citation Sippy, KBAnderson, DJBunnelle, WHHutchins, CWSchrimpf, MR Preparation and characterization of N-(3-pyridinyl) spirocyclic diamines as ligands for nicotinic acetylcholine receptors. Bioorg Med Chem Lett19:1682-5 (2009) 
 
Neuronal acetylcholine receptor subunit alpha-4
Name:Neuronal acetylcholine receptor subunit alpha-4
Type:Enzyme
Mol. Mass.:70196.44
Organism:Rattus norvegicus (Rat)
Description:P09483
Residue:630
BDBM50062641
NameBDBM50062641
Synonyms:5-((R)-1-Azetidin-2-ylmethoxy)-2-chloro-pyridine TEBENICILINE | Tebanicline tosylate
TypeSmall organic molecule
Emp. Form.C9H11ClN2O
Mol. Mass.198.649
SMILESClc1ccc(OC[C@H]2CCN2)cn1