Reaction Details
TargetCholesteryl ester transfer protein
LigandBDBM50276348
Substrate/Competitorn/a
Meas. Tech.ChEMBL_542644 (CHEMBL1015033)
IC50 39±n/a nM
Citation Kuo, GHRano, TPelton, PDemarest, KTGibbs, ACMurray, WVDamiano, BPConnelly, MA Design, synthesis, and biological evaluation of (2R,alphaS)-3,4-dihydro-2-[3-(1,1,2,2-tetrafluoroethoxy)phenyl]-5-[3-(trifluoromethoxy)-phenyl]-alpha-(trifluoromethyl)-1(2H)-quinolineethanol as potent and orally active cholesteryl ester transfer protein inhibitor. J Med Chem52:1768-72 (2009) 
 
Cholesteryl ester transfer protein
Name:Cholesteryl ester transfer protein
Type:Enzyme
Mol. Mass.:54751.53
Organism:Homo sapiens (Human)
Description:P11597
Residue:493
BDBM50276348
NameBDBM50276348
Synonyms:(2R, aS)-3,4-dihydro-2-[3-(1,1,2,2-tetrafluoroethoxy)phenyl]-5-[3-(trifluoromethoxy)-phenyl]-a-(trifluoromethyl)-1(2H)-quinolineethanol CHEMBL516439
TypeSmall organic molecule
Emp. Form.C27H21F10NO3
Mol. Mass.597.4446
SMILESO[C@@H](CN1[C@H](CCc2c1cccc2-c1cccc(OC(F)(F)F)c1)c1cccc(OC(F)(F)C(F)F)c1)C(F)(F)F