Reaction Details
TargetAlpha-2B adrenergic receptor
LigandBDBM50090256
Substrate/Competitorn/a
Meas. Tech.ChEMBL_564353 (CHEMBL957655)
EC50 0.500000±n/a nM
Citation Davis, RAFechner, GASykes, MGaravelas, APass, DMCarroll, ARAddepalli, RAvery, VMHooper, JNQuinn, RJ (-)-Dibromophakellin: an alpha2B adrenoceptor agonist isolated from the Australian marine sponge, Acanthella costata. Bioorg Med Chem17:2497-500 (2009) 
 
Alpha-2B adrenergic receptor
Name:Alpha-2B adrenergic receptor
Type:Enzyme
Mol. Mass.:49964.20
Organism:Homo sapiens (Human)
Description:P18089
Residue:450
BDBM50090256
NameBDBM50090256
Synonyms:(R)-2-((S)-1,2-dihydroxyethyl)-4,5-dihydroxyfuran-3(2H)-one (R)-5-((S)-1,2-dihydroxyethyl)-3,4-dihydroxyfuran-2(5H)-one CHEMBL196 vitamin C
TypeSmall organic molecule
Emp. Form.C6H8O6
Mol. Mass.176.1241
SMILESOC[C@H](O)c1oc(O)c(O)c1O