Reaction Details
TargetTyrosine-protein kinase ITK/TSK
LigandBDBM50257698
Substrate/Competitorn/a
Meas. Tech.ChEMBL_562393 (CHEMBL1018826)
IC50 2±n/a nM
Citation Riether, DZindell, RKowalski, JACook, BNBentzien, JLombaert, SDThomson, DKugler, SZSkow, DMartin, LSRaymond, ELKhine, HHO'Shea, KWoska, JRJeanfavre, DSellati, RRalph, KLAhlberg, JLabissiere, GKashem, MAPullen, SSTakahashi, H 5-Aminomethylbenzimidazoles as potent ITK antagonists. Bioorg Med Chem Lett19:1588-91 (2009) 
 
Tyrosine-protein kinase ITK/TSK
Name:Tyrosine-protein kinase ITK/TSK
Type:Protein
Mol. Mass.:71839.20
Organism:Homo sapiens (Human)
Description:Q08881
Residue:620
BDBM50257698
NameBDBM50257698
Synonyms:CHEMBL522849 | N-(5-((cyclohexyl(methyl)amino)methyl)-1-(2-hydroxy-2-methylpropyl)-1H-benzo[d]imidazol-2(3H)-ylidene)-5-(1H-pyrazol-4-yl)thiophene-2-carboxamide
TypeSmall organic molecule
Emp. Form.C27H34N6O2S
Mol. Mass.506.663
SMILESCN(Cc1ccc2n(CC(C)(C)O)c(NC(=O)c3ccc(s3)-c3cn[nH]c3)nc2c1)C1CCCCC1