Reaction Details
TargetTyrosine-protein kinase ITK/TSK
LigandBDBM50257699
Substrate/Competitorn/a
Meas. Tech.ChEMBL_562393 (CHEMBL1018826)
IC50 1±n/a nM
Citation Riether, DZindell, RKowalski, JACook, BNBentzien, JLombaert, SDThomson, DKugler, SZSkow, DMartin, LSRaymond, ELKhine, HHO'Shea, KWoska, JRJeanfavre, DSellati, RRalph, KLAhlberg, JLabissiere, GKashem, MAPullen, SSTakahashi, H 5-Aminomethylbenzimidazoles as potent ITK antagonists. Bioorg Med Chem Lett19:1588-91 (2009) 
 
Tyrosine-protein kinase ITK/TSK
Name:Tyrosine-protein kinase ITK/TSK
Type:Protein
Mol. Mass.:71839.20
Organism:Homo sapiens (Human)
Description:Q08881
Residue:620
BDBM50257699
NameBDBM50257699
Synonyms:CHEMBL493928 | N-(5-((cyclohexylamino)methyl)-1-(2-hydroxy-2-methylpropyl)-1H-benzo[d]imidazol-2(3H)-ylidene)-5-(1H-pyrazol-4-yl)thiophene-2-carboxamide
TypeSmall organic molecule
Emp. Form.C26H32N6O2S
Mol. Mass.492.636
SMILESCC(C)(O)Cn1c(NC(=O)c2ccc(s2)-c2cn[nH]c2)nc2cc(CNC3CCCCC3)ccc12