Reaction Details
TargetTyrosine-protein kinase ITK/TSK
LigandBDBM50257915
Substrate/Competitorn/a
Meas. Tech.ChEMBL_562393 (CHEMBL1018826)
IC50 3±n/a nM
Citation Riether, DZindell, RKowalski, JACook, BNBentzien, JLombaert, SDThomson, DKugler, SZSkow, DMartin, LSRaymond, ELKhine, HHO'Shea, KWoska, JRJeanfavre, DSellati, RRalph, KLAhlberg, JLabissiere, GKashem, MAPullen, SSTakahashi, H 5-Aminomethylbenzimidazoles as potent ITK antagonists. Bioorg Med Chem Lett19:1588-91 (2009) 
 
Tyrosine-protein kinase ITK/TSK
Name:Tyrosine-protein kinase ITK/TSK
Type:Protein
Mol. Mass.:71839.20
Organism:Homo sapiens (Human)
Description:Q08881
Residue:620
BDBM50257915
NameBDBM50257915
Synonyms:CHEMBL493007 | N-(1-(2-hydroxy-2-methylpropyl)-5-(piperidin-1-ylmethyl)-1H-benzo[d]imidazol-2(3H)-ylidene)-5-(1H-pyrazol-4-yl)thiophene-2-carboxamide
TypeSmall organic molecule
Emp. Form.C25H30N6O2S
Mol. Mass.478.61
SMILESCC(C)(O)Cn1c(NC(=O)c2ccc(s2)-c2cn[nH]c2)nc2cc(CN3CCCCC3)ccc12