Reaction Details
TargetNH(3)-dependent NAD(+) synthetase
LigandBDBM50266767
Substrate/Competitorn/a
Meas. Tech.ChEMBL_564355 (CHEMBL957657)
IC50 118000±n/a nM
Citation Moro, WBYang, ZKane, TABrouillette, CGBrouillette, WJ Virtual screening to identify lead inhibitors for bacterial NAD synthetase (NADs). Bioorg Med Chem Lett19:2001-5 (2009) 
 
NH(3)-dependent NAD(+) synthetase
Name:NH(3)-dependent NAD(+) synthetase
Type:Enzyme
Mol. Mass.:30092.16
Organism:Bacillus anthracis
Description:Q81RP3
Residue:272
BDBM50266767
NameBDBM50266767
Synonyms:2,2'-(3,6-dioxocyclohexa-1,4-diene-1,4-diyl)bis(azanediyl)dibenzoic acid | CHEMBL475959
TypeSmall organic molecule
Emp. Form.C20H14N2O6
Mol. Mass.378.335
SMILESOC(=O)c1ccccc1NC1=CC(=O)C(Nc2ccccc2C(O)=O)=CC1=O