Reaction Details
TargetCannabinoid receptor 1
LigandBDBM50244360
Substrate/Competitorn/a
Meas. Tech.ChEMBL_564384 (CHEMBL962379)
Ki 1.08±n/a nM
Citation Ferreira, AMKrishnamurthy, MMoore, BMFinkelstein, DBashford, D Quantitative structure-activity relationship (QSAR) for a series of novel cannabinoid derivatives using descriptors derived from semi-empirical quantum-chemical calculations. Bioorg Med Chem17:2598-606 (2009) 
 
Cannabinoid receptor 1
Name:Cannabinoid receptor 1
Type:G Protein-Coupled Receptor (GPCR)
Mol. Mass.:52868.96
Organism:Homo sapiens (Human)
Description:P21554
Residue:472
BDBM50244360
NameBDBM50244360
Synonyms:(6aR,10aR)-6,6,9-trimethyl-3-(2-(thiophen-2-yl)propan-2-yl)-6a,7,10,10a-tetrahydro-6H-benzo[c]chromen-1-ol CHEMBL519575
TypeSmall organic molecule
Emp. Form.C23H28O2S
Mol. Mass.368.532
SMILESCC1=CC[C@@H]2[C@@H](C1)c1c(O)cc(cc1OC2(C)C)C(C)(C)c1cccs1