Reaction Details
TargetCannabinoid receptor 1
LigandBDBM50133546
Substrate/Competitorn/a
Meas. Tech.ChEMBL_564384 (CHEMBL962379)
Ki 12.3±n/a nM
Citation Ferreira, AMKrishnamurthy, MMoore, BMFinkelstein, DBashford, D Quantitative structure-activity relationship (QSAR) for a series of novel cannabinoid derivatives using descriptors derived from semi-empirical quantum-chemical calculations. Bioorg Med Chem17:2598-606 (2009) 
 
Cannabinoid receptor 1
Name:Cannabinoid receptor 1
Type:G Protein-Coupled Receptor (GPCR)
Mol. Mass.:52868.96
Organism:Homo sapiens (Human)
Description:P21554
Residue:472
BDBM50133546
NameBDBM50133546
Synonyms:(6aR,10aR)-6,6,9-Trimethyl-3-(1-methyl-1-phenyl-ethyl)-6a,7,10,10a-tetrahydro-6H-benzo[c]chromen-1-ol 6,6,9-trimethyl-3-(2-phenylpropan-2-yl)-6a,7,10,10a-tetrahydro-6H-benzo[c]chromen-1-ol KM-233
TypeSmall organic molecule
Emp. Form.C25H30O2
Mol. Mass.362.5045
SMILESCC1=CC[C@@H]2[C@@H](C1)c1c(O)cc(cc1OC2(C)C)C(C)(C)c1ccccc1