Reaction Details
Target5-hydroxytryptamine receptor 4
LigandBDBM50413548
Substrate/Competitorn/a
Meas. Tech.ChEMBL_564555 (CHEMBL963182)
Ki 5.37±n/a nM
Citation Lemaître, SLepailleur, ABureau, RButt-Gueulle, SLelong-Boulouard, VDuchatelle, PBoulouard, MDumuis, ADaveu, CLezoualc'h, FPfeiffer, BDauphin, FRault, S Novel antagonists of serotonin-4 receptors: synthesis and biological evaluation of pyrrolothienopyrazines. Bioorg Med Chem17:2607-22 (2009) 
 
5-hydroxytryptamine receptor 4
Name:5-hydroxytryptamine receptor 4
Type:Enzyme Catalytic Domain
Mol. Mass.:43735.29
Organism:GUINEA PIG
Description:5-HT4 HTR4 GUINEA PIG::O70528
Residue:388
BDBM50413548
NameBDBM50413548
Synonyms:CHEMBL512679
TypeSmall organic molecule
Emp. Form.C20H27N3OS
Mol. Mass.357.513
SMILESCCCCN1CCC(COc2nc3scc(C)c3n3cccc23)CC1