Reaction Details
TargetPeroxisome proliferator-activated receptor alpha
LigandBDBM28661
Substrate/Competitorn/a
Meas. Tech.ChEMBL_565039 (CHEMBL959182)
EC50>10000±n/a nM
Citation Otero, MPPérez Santín, ERodríguez-Barrios, FVaz, Bde Lera, AR Selective, potent PPARgamma agonists with cyclopentenone core structure. Bioorg Med Chem Lett19:1883-6 (2009) 
 
Peroxisome proliferator-activated receptor alpha
Name:Peroxisome proliferator-activated receptor alpha
Type:Enzyme
Mol. Mass.:52222.08
Organism:Homo sapiens (Human)
Description:Q07869
Residue:468
BDBM28661
NameBDBM28661
Synonyms:2-{2-methyl-4-[({4-methyl-2-[4-(trifluoromethyl)phenyl]-1,3-thiazol-5-yl}methyl)sulfanyl]phenoxy}acetic acid GW 501516 GW1516 | GW501516
TypeSmall organic molecule
Emp. Form.C21H18F3NO3S2
Mol. Mass.453.498
SMILESCc1nc(sc1CSc1ccc(OCC(O)=O)c(C)c1)-c1ccc(cc1)C(F)(F)F