Reaction Details
TargetIntermediate conductance calcium-activated potassium channel protein 4
LigandBDBM31774
Substrate/Competitorn/a
Meas. Tech.ChEMBL_545455 (CHEMBL1032478)
IC50 70±n/a nM
Citation Pegoraro, SLang, MDreker, TKraus, JHamm, SMeere, CFeurle, JTasler, SPrütting, SKuras, ZVisan, VGrissmer, S Inhibitors of potassium channels KV1.3 and IK-1 as immunosuppressants. Bioorg Med Chem Lett19:2299-304 (2009) 
 
Intermediate conductance calcium-activated potassium channel protein 4
Name:Intermediate conductance calcium-activated potassium channel protein 4
Type:PROTEIN
Mol. Mass.:47723.22
Organism:Homo sapiens (Human)
Description:ChEMBL_1361891
Residue:427
BDBM31774
NameBDBM31774
Synonyms:CHEMBL104 Clotrimazole Mycelex cid_2812
TypeSmall organic molecule
Emp. Form.C22H17ClN2
Mol. Mass.344.837
SMILESClc1ccccc1C(c1ccccc1)(c1ccccc1)n1ccnc1