Reaction Details
TargetPotassium voltage-gated channel subfamily H member 2
LigandBDBM50278559
Substrate/Competitorn/a
Meas. Tech.ChEMBL_564830 (CHEMBL954296)
Ki 3500±n/a nM
Citation Andrews, MBrown, AChiva, JYFradet, DGordon, DLansdell, MMacKenny, M Design and optimization of selective serotonin re-uptake inhibitors with high synthetic accessibility. Part 1. Bioorg Med Chem Lett19:2329-32 (2009) 
 
Potassium voltage-gated channel subfamily H member 2
Name:Potassium voltage-gated channel subfamily H member 2
Type:Multi-pass membrane protein
Mol. Mass.:126672.65
Organism:Homo sapiens (Human)
Description:Q12809
Residue:1159
BDBM50278559
NameBDBM50278559
Synonyms:7-(piperidin-4-ylmethoxy)-2-naphthonitrile | CHEMBL444985
TypeSmall organic molecule
Emp. Form.C17H18N2O
Mol. Mass.266.3376
SMILESN#Cc1ccc2ccc(OCC3CCNCC3)cc2c1