Reaction Details
TargetSodium-dependent serotonin transporter
LigandBDBM50257394
Substrate/Competitorn/a
Meas. Tech.ChEMBL_566867 (CHEMBL958367)
Ki 5441±n/a nM
Citation Cho, SJJensen, NHKurome, TKadari, SManzano, MLMalberg, JECaldarone, BRoth, BLKozikowski, AP Selective 5-hydroxytryptamine 2C receptor agonists derived from the lead compound tranylcypromine: identification of drugs with antidepressant-like action. J Med Chem52:1885-902 (2009) 
 
Sodium-dependent serotonin transporter
Name:Sodium-dependent serotonin transporter
Type:Multi-pass membrane protein
Mol. Mass.:70322.51
Organism:Homo sapiens (Human)
Description:P31645
Residue:630
BDBM50257394
NameBDBM50257394
Synonyms:CHEMBL445747 | trans-[2-(3-Methylphenyl)cyclopropyl]methylamine Hydrochloride
TypeSmall organic molecule
Emp. Form.C11H15N
Mol. Mass.161.2435
SMILESCc1cccc(c1)[C@H]1C[C@@H]1CN