Reaction Details
Target5-hydroxytryptamine receptor 2C
LigandBDBM50257333
Substrate/Competitorn/a
Meas. Tech.ChEMBL_566866 (CHEMBL958366)
Ki 66±n/a nM
Citation Cho, SJJensen, NHKurome, TKadari, SManzano, MLMalberg, JECaldarone, BRoth, BLKozikowski, AP Selective 5-hydroxytryptamine 2C receptor agonists derived from the lead compound tranylcypromine: identification of drugs with antidepressant-like action. J Med Chem52:1885-902 (2009) 
 
5-hydroxytryptamine receptor 2C
Name:5-hydroxytryptamine receptor 2C
Type:G Protein-Coupled Receptor (GPCR)
Mol. Mass.:51836.79
Organism:Homo sapiens (Human)
Description:P28335
Residue:458
BDBM50257333
NameBDBM50257333
Synonyms:(+)-(S,S)-trans-[2-(2-Bromophenyl)cyclopropyl]methylamine Hydrochloride | CHEMBL467736
TypeSmall organic molecule
Emp. Form.C10H12BrN
Mol. Mass.226.113
SMILESNC[C@H]1C[C@@H]1c1ccccc1Br