Reaction Details
Target5-hydroxytryptamine receptor 2A
LigandBDBM50257398
Substrate/Competitorn/a
Meas. Tech.ChEMBL_566864 (CHEMBL958364)
Ki 2778±n/a nM
Citation Cho, SJJensen, NHKurome, TKadari, SManzano, MLMalberg, JECaldarone, BRoth, BLKozikowski, AP Selective 5-hydroxytryptamine 2C receptor agonists derived from the lead compound tranylcypromine: identification of drugs with antidepressant-like action. J Med Chem52:1885-902 (2009) 
 
5-hydroxytryptamine receptor 2A
Name:5-hydroxytryptamine receptor 2A
Type:undefined
Mol. Mass.:52607.65
Organism:Homo sapiens (Human)
Description:P28223
Residue:471
BDBM50257398
NameBDBM50257398
Synonyms:CHEMBL493130 | trans-[2-(4-Fluorophenyl)cyclopropyl]methylamine Hydrochloride
TypeSmall organic molecule
Emp. Form.C10H12FN
Mol. Mass.165.2074
SMILESNC[C@H]1C[C@@H]1c1ccc(F)cc1