Reaction Details
TargetProcathepsin L
LigandBDBM50257015
Substrate/Competitorn/a
Meas. Tech.ChEMBL_562603 (CHEMBL1015279)
Ki 2700±n/a nM
Citation Ettari, RMicale, NSchirmeister, TGelhaus, CLeippe, MNizi, EDi Francesco, MEGrasso, SZappalà, M Novel peptidomimetics containing a vinyl ester moiety as highly potent and selective falcipain-2 inhibitors. J Med Chem52:2157-60 (2009) 
 
Procathepsin L
Name:Procathepsin L
Type:Enzyme
Mol. Mass.:37557.19
Organism:Homo sapiens (Human)
Description:Purchased from Calbiochem (San Diego, CA).
Residue:333
BDBM50257015
NameBDBM50257015
Synonyms:(4S)-4-{2-[3-(4-Chloro-2-trifluoromethyl-phenylcarbamoyloxymethyl)-(3R)-2-oxo-5-phenyl-2,3-dihydro-benzo[e][1,4]diazepin-1-yl]-acetylamino}-6-phenyl-hex-2-enoic acid methyl ester | CHEMBL453473
TypeSmall organic molecule
Emp. Form.C39H34ClF3N4O6
Mol. Mass.747.159
SMILESCOC(=O)\C=C\[C@H](CCc1ccccc1)NC(=O)CN1c2ccccc2C(=N[C@H](COC(=O)Nc2ccc(Cl)cc2C(F)(F)F)C1=O)c1ccccc1