Reaction Details
TargetCoagulation factor X
LigandBDBM50142163
Substrate/Competitorn/a
Meas. Tech.ChEMBL_497537 (CHEMBL998594)
IC50 4.7±n/a nM
Citation Zhang, PBao, LFan, JJia, ZJSinha, UWong, PWPark, GHutchaleelaha, AScarborough, RMZhu, BY Anthranilamide-based N,N-dialkylbenzamidines as potent and orally bioavailable factor Xa inhibitors: P4 SAR. Bioorg Med Chem Lett19:2186-9 (2009) 
 
Coagulation factor X
Name:Coagulation factor X
Type:Enzyme
Mol. Mass.:54726.60
Organism:Homo sapiens (Human)
Description:n/a
Residue:488
BDBM50142163
NameBDBM50142163
Synonyms:5-Chloro-N-(5-chloro-pyridin-2-yl)-2-[4-(2-imino-oxazolidin-3-ylmethyl)-benzoylamino]-benzamide CHEMBL367953
TypeSmall organic molecule
Emp. Form.C23H19Cl2N5O3
Mol. Mass.484.335
SMILESClc1ccc(NC(=O)c2cc(Cl)ccc2NC(=O)c2ccc(CN3CCOC3=N)cc2)nc1