Reaction Details
TargetCarbonic anhydrase 2
LigandBDBM50159793
Substrate/Competitorn/a
Meas. Tech.ChEMBL_562666 (CHEMBL1011825)
Ki 130000±n/a nM
Citation Innocenti, AHall, RASchlicker, CMühlschlegel, FASupuran, CT Carbonic anhydrase inhibitors. Inhibition of the beta-class enzymes from the fungal pathogens Candida albicans and Cryptococcus neoformans with aliphatic and aromatic carboxylates. Bioorg Med Chem17:2654-7 (2009) 
 
Carbonic anhydrase 2
Name:Carbonic anhydrase 2
Type:Enzyme
Mol. Mass.:29250.71
Organism:Homo sapiens (Human)
Description:P00918
Residue:260
BDBM50159793
NameBDBM50159793
Synonyms:CHEMBL1354 SODIUM ACETATE ANHYDROUS anhydrous sodium acetate | sodium acetate
TypeSmall organic molecule
Emp. Form.C2H3O2
Mol. Mass.59.0446
SMILESCC([O-])=O