Reaction Details
TargetLow molecular weight phosphotyrosine protein phosphatase
LigandBDBM50256796
Substrate/Competitorn/a
Meas. Tech.ChEMBL_562686 (CHEMBL1011845)
Ki 270±n/a nM
Citation Forghieri, MLaggner, CPaoli, PLanger, TManao, GCamici, GBondioli, LPrati, FCostantino, L Synthesis, activity and molecular modeling of a new series of chromones as low molecular weight protein tyrosine phosphatase inhibitors. Bioorg Med Chem17:2658-72 (2009) 
 
Low molecular weight phosphotyrosine protein phosphatase
Name:Low molecular weight phosphotyrosine protein phosphatase
Type:n/a
Mol. Mass.:18042.81
Organism:Homo sapiens (Human)
Description:P24666
Residue:158
BDBM50256796
NameBDBM50256796
Synonyms:6,7-Dihydroxy-2-(4'-hydroxyphenyl)-3-[(1,1'-biphenyl-4-yl)methyl]-4H-1-benzopyran-4-one | CHEMBL515146
TypeSmall organic molecule
Emp. Form.C28H20O5
Mol. Mass.436.4554
SMILESOc1ccc(cc1)-c1oc2cc(O)c(O)cc2c(=O)c1Cc1ccc(cc1)-c1ccccc1