Reaction Details
TargetTyrosine-protein kinase ABL1
LigandBDBM50257156
Substrate/Competitorn/a
Meas. Tech.ChEMBL_562750 (CHEMBL1022422)
IC50 3800±n/a nM
Citation Mahboobi, SDove, SSellmer, AWinkler, MEichhorn, EPongratz, HCiossek, TBaer, TMaier, TBeckers, T Design of chimeric histone deacetylase- and tyrosine kinase-inhibitors: a series of imatinib hybrides as potent inhibitors of wild-type and mutant BCR-ABL, PDGF-Rbeta, and histone deacetylases. J Med Chem52:2265-79 (2009) 
 
Tyrosine-protein kinase ABL1
Name:Tyrosine-protein kinase ABL1
Type:Enzyme
Mol. Mass.:122897.30
Organism:Homo sapiens (Human)
Description:P00519
Residue:1130
BDBM50257156
NameBDBM50257156
Synonyms:(E)-5-(3-(hydroxyamino)-3-oxoprop-1-enyl)-N-(3-(4-(pyridin-3-yl)thiazol-2-ylamino)phenyl)thiophene-2-carboxamide | CHEMBL523684
TypeSmall organic molecule
Emp. Form.C22H17N5O3S2
Mol. Mass.463.532
SMILESONC(=O)\C=C\c1ccc(s1)C(=O)Nc1cccc(Nc2ncc(s2)-c2cccnc2)c1