Reaction Details
TargetPlatelet-derived growth factor receptor beta
LigandBDBM50257116
Substrate/Competitorn/a
Meas. Tech.ChEMBL_562752 (CHEMBL1022424)
IC50 28000±n/a nM
Citation Mahboobi, SDove, SSellmer, AWinkler, MEichhorn, EPongratz, HCiossek, TBaer, TMaier, TBeckers, T Design of chimeric histone deacetylase- and tyrosine kinase-inhibitors: a series of imatinib hybrides as potent inhibitors of wild-type and mutant BCR-ABL, PDGF-Rbeta, and histone deacetylases. J Med Chem52:2265-79 (2009) 
 
Platelet-derived growth factor receptor beta
Name:Platelet-derived growth factor receptor beta
Type:Enzyme
Mol. Mass.:123922.25
Organism:Homo sapiens (Human)
Description:P09619
Residue:1106
BDBM50257116
NameBDBM50257116
Synonyms:CHEMBL474208 | N2-(2-aminophenyl)-N5-(3-(4-(pyridin-3-yl)thiazol-2-ylamino)phenyl)thiophene-2,5-dicarboxamide
TypeSmall organic molecule
Emp. Form.C26H20N6O2S2
Mol. Mass.512.606
SMILESNc1ccccc1NC(=O)c1ccc(s1)C(=O)Nc1cccc(Nc2ncc(s2)-c2cccnc2)c1