Reaction Details
TargetHistone deacetylase 1
LigandBDBM50257154
Substrate/Competitorn/a
Meas. Tech.ChEMBL_562746 (CHEMBL1022418)
IC50 100±n/a nM
Citation Mahboobi, SDove, SSellmer, AWinkler, MEichhorn, EPongratz, HCiossek, TBaer, TMaier, TBeckers, T Design of chimeric histone deacetylase- and tyrosine kinase-inhibitors: a series of imatinib hybrides as potent inhibitors of wild-type and mutant BCR-ABL, PDGF-Rbeta, and histone deacetylases. J Med Chem52:2265-79 (2009) 
 
Histone deacetylase 1
Name:Histone deacetylase 1
Type:Enzyme
Mol. Mass.:55090.27
Organism:Homo sapiens (Human)
Description:Q13547
Residue:482
BDBM50257154
NameBDBM50257154
Synonyms:(E)-4-(3-(hydroxyamino)-3-oxoprop-1-enyl)-N-(3-(4-(pyridin-3-yl)thiazol-2-ylamino)phenyl)benzamide | CHEMBL492956
TypeSmall organic molecule
Emp. Form.C24H19N5O3S
Mol. Mass.457.504
SMILESONC(=O)\C=C\c1ccc(cc1)C(=O)Nc1cccc(Nc2ncc(s2)-c2cccnc2)c1