Reaction Details
TargetHistone deacetylase 1
LigandBDBM50257153
Substrate/Competitorn/a
Meas. Tech.ChEMBL_562746 (CHEMBL1022418)
IC50 170±n/a nM
Citation Mahboobi, SDove, SSellmer, AWinkler, MEichhorn, EPongratz, HCiossek, TBaer, TMaier, TBeckers, T Design of chimeric histone deacetylase- and tyrosine kinase-inhibitors: a series of imatinib hybrides as potent inhibitors of wild-type and mutant BCR-ABL, PDGF-Rbeta, and histone deacetylases. J Med Chem52:2265-79 (2009) 
 
Histone deacetylase 1
Name:Histone deacetylase 1
Type:Enzyme
Mol. Mass.:55090.27
Organism:Homo sapiens (Human)
Description:Q13547
Residue:482
BDBM50257153
NameBDBM50257153
Synonyms:CHEMBL521652 | N1-hydroxy-N4-(4-methyl-3-(4-(pyridin-3-yl)thiazol-2-ylamino)phenyl)terephthalamide
TypeSmall organic molecule
Emp. Form.C23H19N5O3S
Mol. Mass.445.494
SMILESCc1ccc(NC(=O)c2ccc(cc2)C(=O)NO)cc1Nc1ncc(s1)-c1cccnc1