Reaction Details
TargetHistone deacetylase 6
LigandBDBM50257116
Substrate/Competitorn/a
Meas. Tech.ChEMBL_562747 (CHEMBL1022419)
IC50>100000±n/a nM
Citation Mahboobi, SDove, SSellmer, AWinkler, MEichhorn, EPongratz, HCiossek, TBaer, TMaier, TBeckers, T Design of chimeric histone deacetylase- and tyrosine kinase-inhibitors: a series of imatinib hybrides as potent inhibitors of wild-type and mutant BCR-ABL, PDGF-Rbeta, and histone deacetylases. J Med Chem52:2265-79 (2009) 
 
Histone deacetylase 6
Name:Histone deacetylase 6
Type:Chromatin regulator; hydrolase; repressor
Mol. Mass.:131381.51
Organism:Homo sapiens (Human)
Description:Q9UBN7
Residue:1215
BDBM50257116
NameBDBM50257116
Synonyms:CHEMBL474208 | N2-(2-aminophenyl)-N5-(3-(4-(pyridin-3-yl)thiazol-2-ylamino)phenyl)thiophene-2,5-dicarboxamide
TypeSmall organic molecule
Emp. Form.C26H20N6O2S2
Mol. Mass.512.606
SMILESNc1ccccc1NC(=O)c1ccc(s1)C(=O)Nc1cccc(Nc2ncc(s2)-c2cccnc2)c1