Reaction Details
TargetVascular endothelial growth factor receptor 2
LigandBDBM50256929
Substrate/Competitorn/a
Meas. Tech.ChEMBL_562753 (CHEMBL1022425)
IC50 6100±n/a nM
Citation Mahboobi, SDove, SSellmer, AWinkler, MEichhorn, EPongratz, HCiossek, TBaer, TMaier, TBeckers, T Design of chimeric histone deacetylase- and tyrosine kinase-inhibitors: a series of imatinib hybrides as potent inhibitors of wild-type and mutant BCR-ABL, PDGF-Rbeta, and histone deacetylases. J Med Chem52:2265-79 (2009) 
 
Vascular endothelial growth factor receptor 2
Name:Vascular endothelial growth factor receptor 2
Type:Receptor Tyrosine Kinase
Mol. Mass.:151510.97
Organism:Homo sapiens (Human)
Description:P35968
Residue:1356
BDBM50256929
NameBDBM50256929
Synonyms:CHEMBL514511 | N1-(2-aminophenyl)-N4-(3-(methyl(4-(pyridin-3-yl)pyrimidin-2-yl)amino)phenyl)terephthalamide
TypeSmall organic molecule
Emp. Form.C30H25N7O2
Mol. Mass.515.5652
SMILESCN(C(=O)c1ccc(cc1)C(=O)Nc1ccccc1N)c1cccc(Nc2nccc(n2)-c2cccnc2)c1