Reaction Details
TargetVascular endothelial growth factor receptor 2
LigandBDBM50257209
Substrate/Competitorn/a
Meas. Tech.ChEMBL_562753 (CHEMBL1022425)
IC50 6700±n/a nM
Citation Mahboobi, SDove, SSellmer, AWinkler, MEichhorn, EPongratz, HCiossek, TBaer, TMaier, TBeckers, T Design of chimeric histone deacetylase- and tyrosine kinase-inhibitors: a series of imatinib hybrides as potent inhibitors of wild-type and mutant BCR-ABL, PDGF-Rbeta, and histone deacetylases. J Med Chem52:2265-79 (2009) 
 
Vascular endothelial growth factor receptor 2
Name:Vascular endothelial growth factor receptor 2
Type:Receptor Tyrosine Kinase
Mol. Mass.:151510.97
Organism:Homo sapiens (Human)
Description:P35968
Residue:1356
BDBM50257209
NameBDBM50257209
Synonyms:(E)-5-(3-(hydroxyamino)-3-oxoprop-1-enyl)-N-(4-methyl-3-(4-(pyridin-3-yl)thiazol-2-ylamino)phenyl)thiophene-2-carboxamide | CHEMBL493315
TypeSmall organic molecule
Emp. Form.C23H19N5O3S2
Mol. Mass.477.559
SMILESCc1ccc(NC(=O)c2ccc(\C=C\C(=O)NO)s2)cc1Nc1ncc(s1)-c1cccnc1