Reaction Details
TargetVascular endothelial growth factor receptor 2
LigandBDBM50256927
Substrate/Competitorn/a
Meas. Tech.ChEMBL_562753 (CHEMBL1022425)
IC50 7800±n/a nM
Citation Mahboobi, SDove, SSellmer, AWinkler, MEichhorn, EPongratz, HCiossek, TBaer, TMaier, TBeckers, T Design of chimeric histone deacetylase- and tyrosine kinase-inhibitors: a series of imatinib hybrides as potent inhibitors of wild-type and mutant BCR-ABL, PDGF-Rbeta, and histone deacetylases. J Med Chem52:2265-79 (2009) 
 
Vascular endothelial growth factor receptor 2
Name:Vascular endothelial growth factor receptor 2
Type:Receptor Tyrosine Kinase
Mol. Mass.:151510.97
Organism:Homo sapiens (Human)
Description:P35968
Residue:1356
BDBM50256927
NameBDBM50256927
Synonyms:CHEMBL475796 | N-(2-aminophenyl)-4-((4-methyl-3-(4-(pyridin-3-yl)pyrimidin-2-ylamino)phenylamino)methyl)benzamide
TypeSmall organic molecule
Emp. Form.C30H27N7O
Mol. Mass.501.5817
SMILESCc1ccc(NCc2ccc(cc2)C(=O)Nc2ccccc2N)cc1Nc1nccc(n1)-c1cccnc1