Reaction Details
TargetAdenosine receptor A3
LigandBDBM50267535
Substrate/Competitorn/a
Meas. Tech.ChEMBL_562994 (CHEMBL1015331)
Ki 1150±n/a nM
Citation Franchetti, PCappellacci, LVita, PPetrelli, RLavecchia, AKachler, SKlotz, KNMarabese, ILuongo, LMaione, SGrifantini, M N6-Cycloalkyl- and N6-bicycloalkyl-C5'(C2')-modified adenosine derivatives as high-affinity and selective agonists at the human A1 adenosine receptor with antinociceptive effects in mice. J Med Chem52:2393-406 (2009) 
 
Adenosine receptor A3
Name:Adenosine receptor A3
Type:G Protein-Coupled Receptor (GPCR)
Mol. Mass.:36197.32
Organism:Homo sapiens (Human)
Description:P0DMS8
Residue:318
BDBM50267535
NameBDBM50267535
Synonyms:2-Chloro-N6-cyclopentyl-9H-[2-C-methyl-5-deoxy-5-(2-fluorophenylthio)-beta-D-ribofuranosyl]adenine | CHEMBL489226
TypeSmall organic molecule
Emp. Form.C22H25ClFN5O3S
Mol. Mass.493.982
SMILESC[C@@]1(O)[C@H](O)[C@@H](CSc2ccccc2F)O[C@H]1n1cnc2c(NC3CCCC3)nc(Cl)nc12