Reaction Details
TargetAdenosine receptor A3
LigandBDBM50267576
Substrate/Competitorn/a
Meas. Tech.ChEMBL_562994 (CHEMBL1015331)
Ki 4490±n/a nM
Citation Franchetti, PCappellacci, LVita, PPetrelli, RLavecchia, AKachler, SKlotz, KNMarabese, ILuongo, LMaione, SGrifantini, M N6-Cycloalkyl- and N6-bicycloalkyl-C5'(C2')-modified adenosine derivatives as high-affinity and selective agonists at the human A1 adenosine receptor with antinociceptive effects in mice. J Med Chem52:2393-406 (2009) 
 
Adenosine receptor A3
Name:Adenosine receptor A3
Type:G Protein-Coupled Receptor (GPCR)
Mol. Mass.:36197.32
Organism:Homo sapiens (Human)
Description:P0DMS8
Residue:318
BDBM50267576
NameBDBM50267576
Synonyms:2-Chloro-N6-(+/-)-endo-norbornyl-9H-(2-C-methyl-beta-D-ribofuranosyl)adenine | CHEMBL489639
TypeSmall organic molecule
Emp. Form.C18H24ClN5O4
Mol. Mass.409.867
SMILESC[C@@]1(O)[C@H](O)[C@@H](CO)O[C@H]1n1cnc2c(NC3CC4CCC3C4)nc(Cl)nc12