Reaction Details
TargetAdenosine receptor A2a
LigandBDBM50267477
Substrate/Competitorn/a
Meas. Tech.ChEMBL_562992 (CHEMBL1015329)
Ki 5170±n/a nM
Citation Franchetti, PCappellacci, LVita, PPetrelli, RLavecchia, AKachler, SKlotz, KNMarabese, ILuongo, LMaione, SGrifantini, M N6-Cycloalkyl- and N6-bicycloalkyl-C5'(C2')-modified adenosine derivatives as high-affinity and selective agonists at the human A1 adenosine receptor with antinociceptive effects in mice. J Med Chem52:2393-406 (2009) 
 
Adenosine receptor A2a
Name:Adenosine receptor A2a
Type:G Protein-Coupled Receptor (GPCR)
Mol. Mass.:44716.46
Organism:Homo sapiens (Human)
Description:P29274
Residue:412
BDBM50267477
NameBDBM50267477
Synonyms:CHEMBL477666 | N6-cyclopentyl-5'-(2-fluorophenylthio)-5'-deoxyadenosine
TypeSmall organic molecule
Emp. Form.C21H24FN5O3S
Mol. Mass.445.51
SMILESO[C@@H]1[C@@H](CSc2ccccc2F)O[C@H]([C@@H]1O)n1cnc2c(NC3CCCC3)ncnc12