Reaction Details
TargetBeta-secretase 2
LigandBDBM16253
Substrate/Competitorn/a
Meas. Tech.ChEMBL_563272 (CHEMBL981029)
Ki 356±n/a nM
Citation Ghosh, AK Harnessing nature's insight: design of aspartyl protease inhibitors from treatment of drug-resistant HIV to Alzheimer's disease. J Med Chem52:2163-76 (2009) 
 
Beta-secretase 2
Name:Beta-secretase 2
Type:Protein
Mol. Mass.:56171.20
Organism:Homo sapiens (Human)
Description:Q9Y5Z0
Residue:518
BDBM16253
NameBDBM16253
Synonyms:(3,5-dimethyl-1H-pyrazol-1-yl)methyl N-[(1R)-1-{[(1R,3S,4S)-3-hydroxy-1,6-dimethyl-1-{[(1S)-2-methyl-1-[(2-methylpropyl)carbamoyl]propyl]carbamoyl}heptan-4-yl]carbamoyl}-2-methanesulfonylethyl]carbamate N2-[(2R,4S,5S)-5-{[N-{[(3,5-dimethyl-1H-pyrazol-1-yl)methoxy]carbonyl}-3-(methylsulfonyl)-L-alanyl]amino}-4-hydroxy-2,7-dimethyloctanoyl]-N-(2-methylpropyl)-L-valinamide | pyrazole-bearing inhibitor 5
TypeSmall organic molecule
Emp. Form.C30H54N6O8S
Mol. Mass.658.85
SMILESCC(C)CNC(=O)[C@@H](NC(=O)[C@H](C)C[C@H](O)[C@H](CC(C)C)NC(=O)[C@H](CS(C)(=O)=O)NC(=O)OCn1nc(C)cc1C)C(C)C