Reaction Details
TargetCathepsin D
LigandBDBM16253
Substrate/Competitorn/a
Meas. Tech.ChEMBL_563273 (CHEMBL981030)
Ki 131±n/a nM
Citation Ghosh, AK Harnessing nature's insight: design of aspartyl protease inhibitors from treatment of drug-resistant HIV to Alzheimer's disease. J Med Chem52:2163-76 (2009) 
 
Cathepsin D
Name:Cathepsin D
Type:Enzyme
Mol. Mass.:44551.72
Organism:Homo sapiens (Human)
Description:Human proCathepsin D (SwissProt accession number P07339) was expressed in Sf9 cells, purified, and autoactivated.
Residue:412
BDBM16253
NameBDBM16253
Synonyms:(3,5-dimethyl-1H-pyrazol-1-yl)methyl N-[(1R)-1-{[(1R,3S,4S)-3-hydroxy-1,6-dimethyl-1-{[(1S)-2-methyl-1-[(2-methylpropyl)carbamoyl]propyl]carbamoyl}heptan-4-yl]carbamoyl}-2-methanesulfonylethyl]carbamate N2-[(2R,4S,5S)-5-{[N-{[(3,5-dimethyl-1H-pyrazol-1-yl)methoxy]carbonyl}-3-(methylsulfonyl)-L-alanyl]amino}-4-hydroxy-2,7-dimethyloctanoyl]-N-(2-methylpropyl)-L-valinamide | pyrazole-bearing inhibitor 5
TypeSmall organic molecule
Emp. Form.C30H54N6O8S
Mol. Mass.658.85
SMILESCC(C)CNC(=O)[C@@H](NC(=O)[C@H](C)C[C@H](O)[C@H](CC(C)C)NC(=O)[C@H](CS(C)(=O)=O)NC(=O)OCn1nc(C)cc1C)C(C)C