Reaction Details
TargetMitogen-activated protein kinase 13
LigandBDBM50277910
Substrate/Competitorn/a
Meas. Tech.ChEMBL_501958 (CHEMBL985881)
IC50 1200±n/a nM
Citation Humphries, PSLafontaine, JAAgree, CSAlexander, DChen, PDo, QQLi, LYLunney, EARajapakse, RJSiegel, KTimofeevski, SLWang, TWilhite, DM Synthesis and SAR of 4-substituted-2-aminopyrimidines as novel c-Jun N-terminal kinase (JNK) inhibitors. Bioorg Med Chem Lett19:2099-102 (2009) 
 
Mitogen-activated protein kinase 13
Name:Mitogen-activated protein kinase 13
Type:Enzyme
Mol. Mass.:42097.16
Organism:Homo sapiens (Human)
Description:O15264
Residue:365
BDBM50277910
NameBDBM50277910
Synonyms:4-(4-(2-(cyclopentylamino)pyrimidin-4-yl)-1H-pyrazol-3-yl)cyclohexanol | CHEMBL507249
TypeSmall organic molecule
Emp. Form.C18H25N5O
Mol. Mass.327.424
SMILESO[C@H]1CC[C@@H](CC1)c1[nH]ncc1-c1ccnc(NC2CCCC2)n1