Reaction Details
TargetMitogen-activated protein kinase 8
LigandBDBM50277837
Substrate/Competitorn/a
Meas. Tech.ChEMBL_501722 (CHEMBL985050)
Ki 151±n/a nM
Citation Humphries, PSLafontaine, JAAgree, CSAlexander, DChen, PDo, QQLi, LYLunney, EARajapakse, RJSiegel, KTimofeevski, SLWang, TWilhite, DM Synthesis and SAR of 4-substituted-2-aminopyrimidines as novel c-Jun N-terminal kinase (JNK) inhibitors. Bioorg Med Chem Lett19:2099-102 (2009) 
 
Mitogen-activated protein kinase 8
Name:Mitogen-activated protein kinase 8
Type:Enzyme
Mol. Mass.:48297.57
Organism:Homo sapiens (Human)
Description:JNK-1 was purchased from Upstate Cell Signaling Solutions (formerly Upstate Biotechnology).
Residue:427
BDBM50277837
NameBDBM50277837
Synonyms:4-(3-(4-chlorophenyl)-1H-pyrazol-4-yl)-N-cyclopropylpyrimidin-2-amine | CHEMBL521016
TypeSmall organic molecule
Emp. Form.C16H14ClN5
Mol. Mass.311.769
SMILESClc1ccc(cc1)-c1n[nH]cc1-c1ccnc(NC2CC2)n1