Reaction Details
TargetMitogen-activated protein kinase 8
LigandBDBM50277868
Substrate/Competitorn/a
Meas. Tech.ChEMBL_501722 (CHEMBL985050)
Ki 315±n/a nM
Citation Humphries, PSLafontaine, JAAgree, CSAlexander, DChen, PDo, QQLi, LYLunney, EARajapakse, RJSiegel, KTimofeevski, SLWang, TWilhite, DM Synthesis and SAR of 4-substituted-2-aminopyrimidines as novel c-Jun N-terminal kinase (JNK) inhibitors. Bioorg Med Chem Lett19:2099-102 (2009) 
 
Mitogen-activated protein kinase 8
Name:Mitogen-activated protein kinase 8
Type:Enzyme
Mol. Mass.:48297.57
Organism:Homo sapiens (Human)
Description:JNK-1 was purchased from Upstate Cell Signaling Solutions (formerly Upstate Biotechnology).
Residue:427
BDBM50277868
NameBDBM50277868
Synonyms:(R)-3-(4-(3-(4-chlorophenyl)-1H-pyrazol-4-yl)pyrimidin-2-ylamino)butanoic acid | CHEMBL484341
TypeSmall organic molecule
Emp. Form.C17H16ClN5O2
Mol. Mass.357.794
SMILESC[C@H](CC(O)=O)Nc1nccc(n1)-c1c[nH]nc1-c1ccc(Cl)cc1