Reaction Details
TargetMitogen-activated protein kinase 8
LigandBDBM50277873
Substrate/Competitorn/a
Meas. Tech.ChEMBL_501722 (CHEMBL985050)
Ki 43±n/a nM
Citation Humphries, PSLafontaine, JAAgree, CSAlexander, DChen, PDo, QQLi, LYLunney, EARajapakse, RJSiegel, KTimofeevski, SLWang, TWilhite, DM Synthesis and SAR of 4-substituted-2-aminopyrimidines as novel c-Jun N-terminal kinase (JNK) inhibitors. Bioorg Med Chem Lett19:2099-102 (2009) 
 
Mitogen-activated protein kinase 8
Name:Mitogen-activated protein kinase 8
Type:Enzyme
Mol. Mass.:48297.57
Organism:Homo sapiens (Human)
Description:JNK-1 was purchased from Upstate Cell Signaling Solutions (formerly Upstate Biotechnology).
Residue:427
BDBM50277873
NameBDBM50277873
Synonyms:CHEMBL485365 | N-isopropyl-4-(3-(tetrahydro-2H-pyran-3-yl)-1H-pyrazol-4-yl)pyrimidin-2-amine
TypeSmall organic molecule
Emp. Form.C15H21N5O
Mol. Mass.287.3601
SMILESCC(C)Nc1nccc(n1)-c1cn[nH]c1C1CCCOC1