Reaction Details
Target5-hydroxytryptamine receptor 5A
LigandBDBM50267555
Substrate/Competitorn/a
Meas. Tech.ChEMBL_563491 (CHEMBL961039)
Ki>10000±n/a nM
Citation Herth, MMKramer, VPiel, MPalner, MRiss, PJKnudsen, GMRösch, F Synthesis and in vitro affinities of various MDL 100907 derivatives as potential 18F-radioligands for 5-HT2A receptor imaging with PET. Bioorg Med Chem17:2989-3002 (2009) 
 
5-hydroxytryptamine receptor 5A
Name:5-hydroxytryptamine receptor 5A
Type:Enzyme
Mol. Mass.:40266.25
Organism:Homo sapiens (Human)
Description:P47898
Residue:357
BDBM50267555
NameBDBM50267555
Synonyms:(3-(2-Fluoroethoxy)-2-methoxyphenyl)-(1-(2-p-methoxyphenylethyl)-piperidine-4-yl)-methanol | CHEMBL490633
TypeSmall organic molecule
Emp. Form.C24H32FNO4
Mol. Mass.417.5136
SMILESCOc1ccc(CCN2CCC(CC2)C(O)c2cccc(OCCF)c2OC)cc1