Reaction Details
TargetD(4) dopamine receptor
LigandBDBM50267510
Substrate/Competitorn/a
Meas. Tech.ChEMBL_563495 (CHEMBL961043)
Ki 2708±n/a nM
Citation Herth, MMKramer, VPiel, MPalner, MRiss, PJKnudsen, GMRösch, F Synthesis and in vitro affinities of various MDL 100907 derivatives as potential 18F-radioligands for 5-HT2A receptor imaging with PET. Bioorg Med Chem17:2989-3002 (2009) 
 
D(4) dopamine receptor
Name:D(4) dopamine receptor
Type:Enzyme
Mol. Mass.:48373.19
Organism:Homo sapiens (Human)
Description:P21917
Residue:419
BDBM50267510
NameBDBM50267510
Synonyms:(3-(2-Fluoroethoxy)-2-methoxyphenyl)-(1-(2-p-toluylphenylethyl)-piperidine-4-yl)-methanol | CHEMBL476839
TypeSmall organic molecule
Emp. Form.C24H32FNO3
Mol. Mass.401.5142
SMILESCOc1c(OCCF)cccc1C(O)C1CCN(CCc2ccc(C)cc2)CC1