Reaction Details
TargetSodium-dependent dopamine transporter
LigandBDBM50267508
Substrate/Competitorn/a
Meas. Tech.ChEMBL_563506 (CHEMBL961054)
Ki>10000±n/a nM
Citation Herth, MMKramer, VPiel, MPalner, MRiss, PJKnudsen, GMRösch, F Synthesis and in vitro affinities of various MDL 100907 derivatives as potential 18F-radioligands for 5-HT2A receptor imaging with PET. Bioorg Med Chem17:2989-3002 (2009) 
 
Sodium-dependent dopamine transporter
Name:Sodium-dependent dopamine transporter
Type:Multi-pass membrane protein
Mol. Mass.:68497.11
Organism:Homo sapiens (Human)
Description:Q01959
Residue:620
BDBM50267508
NameBDBM50267508
Synonyms:4-(3-(2-Fluoroethoxy)-2-methoxy-benzoyl)-1-(2-p-fluorophenylethyl)-piperidine | CHEMBL516088
TypeSmall organic molecule
Emp. Form.C23H27F2NO3
Mol. Mass.403.4622
SMILESCOc1c(OCCF)cccc1C(=O)C1CCN(CCc2ccc(F)cc2)CC1