Reaction Details
Target5-hydroxytryptamine receptor 1A
LigandBDBM50267510
Substrate/Competitorn/a
Meas. Tech.ChEMBL_563474 (CHEMBL961022)
Ki>10000±n/a nM
Citation Herth, MMKramer, VPiel, MPalner, MRiss, PJKnudsen, GMRösch, F Synthesis and in vitro affinities of various MDL 100907 derivatives as potential 18F-radioligands for 5-HT2A receptor imaging with PET. Bioorg Med Chem17:2989-3002 (2009) 
 
5-hydroxytryptamine receptor 1A
Name:5-hydroxytryptamine receptor 1A
Type:n/a
Mol. Mass.:46122.49
Organism:Homo sapiens (Human)
Description:n/a
Residue:422
BDBM50267510
NameBDBM50267510
Synonyms:(3-(2-Fluoroethoxy)-2-methoxyphenyl)-(1-(2-p-toluylphenylethyl)-piperidine-4-yl)-methanol | CHEMBL476839
TypeSmall organic molecule
Emp. Form.C24H32FNO3
Mol. Mass.401.5142
SMILESCOc1c(OCCF)cccc1C(O)C1CCN(CCc2ccc(C)cc2)CC1