Reaction Details
TargetD(2) dopamine receptor
LigandBDBM50267554
Substrate/Competitorn/a
Meas. Tech.ChEMBL_563478 (CHEMBL961026)
Ki>10000±n/a nM
Citation Herth, MMKramer, VPiel, MPalner, MRiss, PJKnudsen, GMRösch, F Synthesis and in vitro affinities of various MDL 100907 derivatives as potential 18F-radioligands for 5-HT2A receptor imaging with PET. Bioorg Med Chem17:2989-3002 (2009) 
 
D(2) dopamine receptor
Name:D(2) dopamine receptor
Type:Cell-surface receptors
Mol. Mass.:50647.10
Organism:Homo sapiens (Human)
Description:P14416
Residue:443
BDBM50267554
NameBDBM50267554
Synonyms:4-(3-(2-Fluoroethoxy)-2-methoxy-benzoyl)-1-(2-p-toluylethyl)-piperidine | CHEMBL490632
TypeSmall organic molecule
Emp. Form.C24H30FNO3
Mol. Mass.399.4983
SMILESCOc1c(OCCF)cccc1C(=O)C1CCN(CCc2ccc(C)cc2)CC1