Reaction Details
TargetHistamine H1 receptor
LigandBDBM50267507
Substrate/Competitorn/a
Meas. Tech.ChEMBL_563498 (CHEMBL961046)
Ki 509±n/a nM
Citation Herth, MMKramer, VPiel, MPalner, MRiss, PJKnudsen, GMRösch, F Synthesis and in vitro affinities of various MDL 100907 derivatives as potential 18F-radioligands for 5-HT2A receptor imaging with PET. Bioorg Med Chem17:2989-3002 (2009) 
 
Histamine H1 receptor
Name:Histamine H1 receptor
Type:G Protein-Coupled Receptor (GPCR)
Mol. Mass.:55808.72
Organism:Homo sapiens (Human)
Description:Cell pellets from SK-N-MC cells transfected with human H1 receptor were used in binding assay.
Residue:487
BDBM50267507
NameBDBM50267507
Synonyms:(R)-(3-(2-Fluoroethoxy)-2-methoxyphenyl)-(1-(2-p-fluorophenylethyl)-piperidine-4-yl)-methanol | CHEMBL515472
TypeSmall organic molecule
Emp. Form.C23H29F2NO3
Mol. Mass.405.4781
SMILESCOc1c(OCCF)cccc1[C@H](O)C1CCN(CCc2ccc(F)cc2)CC1