Reaction Details
TargetCannabinoid receptor 2
LigandBDBM50267636
Substrate/Competitorn/a
Meas. Tech.ChEMBL_563542 (CHEMBL961829)
Ki 1620±n/a nM
Citation Brizzi, ABrizzi, VCascio, MGCorelli, FGuida, FLigresti, AMaione, SMartinelli, APasquini, STuccinardi, TDi Marzo, V New resorcinol-anandamide"hybrids" as potent cannabinoid receptor ligands endowed with antinociceptive activity in vivo. J Med Chem52:2506-14 (2009) 
 
Cannabinoid receptor 2
Name:Cannabinoid receptor 2
Type:G Protein-Coupled Receptor (GPCR)
Mol. Mass.:39690.94
Organism:Homo sapiens (Human)
Description:P34972
Residue:360
BDBM50267636
NameBDBM50267636
Synonyms:11-(3-butoxy-5-hydroxyphenoxy)-N-(2-hydroxyethyl)undecanamide | CHEMBL489834
TypeSmall organic molecule
Emp. Form.C23H39NO5
Mol. Mass.409.5595
SMILESCCCCOc1cc(O)cc(OCCCCCCCCCCC(=O)NCCO)c1