Reaction Details
TargetCannabinoid receptor 2
LigandBDBM50267634
Substrate/Competitorn/a
Meas. Tech.ChEMBL_563542 (CHEMBL961829)
Ki 570±n/a nM
Citation Brizzi, ABrizzi, VCascio, MGCorelli, FGuida, FLigresti, AMaione, SMartinelli, APasquini, STuccinardi, TDi Marzo, V New resorcinol-anandamide"hybrids" as potent cannabinoid receptor ligands endowed with antinociceptive activity in vivo. J Med Chem52:2506-14 (2009) 
 
Cannabinoid receptor 2
Name:Cannabinoid receptor 2
Type:G Protein-Coupled Receptor (GPCR)
Mol. Mass.:39690.94
Organism:Homo sapiens (Human)
Description:P34972
Residue:360
BDBM50267634
NameBDBM50267634
Synonyms:11-(3-hydroxy-5-(isopentyloxy)phenoxy)-N-(2-hydroxyethyl)undecanamide | CHEMBL489622
TypeSmall organic molecule
Emp. Form.C24H41NO5
Mol. Mass.423.586
SMILESCC(C)CCOc1cc(O)cc(OCCCCCCCCCCC(=O)NCCO)c1