Reaction Details
TargetCannabinoid receptor 2
LigandBDBM50267603
Substrate/Competitorn/a
Meas. Tech.ChEMBL_563542 (CHEMBL961829)
Ki 160±n/a nM
Citation Brizzi, ABrizzi, VCascio, MGCorelli, FGuida, FLigresti, AMaione, SMartinelli, APasquini, STuccinardi, TDi Marzo, V New resorcinol-anandamide"hybrids" as potent cannabinoid receptor ligands endowed with antinociceptive activity in vivo. J Med Chem52:2506-14 (2009) 
 
Cannabinoid receptor 2
Name:Cannabinoid receptor 2
Type:G Protein-Coupled Receptor (GPCR)
Mol. Mass.:39690.94
Organism:Homo sapiens (Human)
Description:P34972
Residue:360
BDBM50267603
NameBDBM50267603
Synonyms:8-(3-hydroxy-5-(2-methyloctan-2-yl)phenoxy)-N-(2-hydroxyethyl)octanamide | CHEMBL491862
TypeSmall organic molecule
Emp. Form.C25H43NO4
Mol. Mass.421.6132
SMILESCCCCCCC(C)(C)c1cc(O)cc(OCCCCCCCC(=O)NCCO)c1